Skip to content

feat(live): add ZIP_STORED visual frame pack and unpack helpers #4266

feat(live): add ZIP_STORED visual frame pack and unpack helpers

feat(live): add ZIP_STORED visual frame pack and unpack helpers #4266

Triggered via pull request October 16, 2026 19:44
Status Failure
Total duration 7m 19s
Artifacts –

continuous-integration.yml

on: pull_request
Pre-commit Linter
1m 23s
Pre-commit Linter
Matrix: type-check
Matrix: unit-test-a2a-v0-3
Matrix: unit-test-mcp-v2
Matrix: unit-test
Fit to window
Zoom out
Zoom in

Annotations

44 errors, 1 warning, and 16 notices
Unit Tests (Python 3.11)
FAILED tests/unittests/telemetry/test_web_ui_functional.py::test_web_ui_is_served_what_capture_on_emits[agent-experimental-span-and-event-schema-v2] - AssertionError: assert not [DivergenceId(owner='log', owner_name='gen_ai.client.inference.operation.details', path=('attributes', 'gen_ai.operati...vergenceId(owner='log', owner_name='gen_ai.client.inference.operation.details', path=('attributes', 'server.address'))]
Unit Tests (Python 3.11)
FAILED tests/unittests/telemetry/test_web_ui_functional.py::test_web_ui_is_served_what_capture_on_emits[agent-experimental-span-and-event-schema-v1] - AssertionError: assert not [DivergenceId(owner='log', owner_name='gen_ai.client.inference.operation.details', path=('attributes', 'gen_ai.operati...vergenceId(owner='log', owner_name='gen_ai.client.inference.operation.details', path=('attributes', 'server.address'))]
Unit Tests (Python 3.11)
FAILED tests/unittests/telemetry/test_web_ui_functional.py::test_web_ui_is_served_what_capture_on_emits[agent-experimental-event-only-schema-v2] - AssertionError: assert not [DivergenceId(owner='log', owner_name='gen_ai.client.inference.operation.details', path=('attributes', 'gen_ai.operati...vergenceId(owner='log', owner_name='gen_ai.client.inference.operation.details', path=('attributes', 'server.address'))]
Unit Tests (Python 3.11)
FAILED tests/unittests/telemetry/test_web_ui_functional.py::test_web_ui_is_served_what_capture_on_emits[agent-experimental-event-only-schema-v1] - AssertionError: assert not [DivergenceId(owner='log', owner_name='gen_ai.client.inference.operation.details', path=('attributes', 'gen_ai.operati...vergenceId(owner='log', owner_name='gen_ai.client.inference.operation.details', path=('attributes', 'server.address'))]
Unit Tests (Python 3.11)
FAILED tests/unittests/telemetry/test_web_ui_functional.py::test_web_ui_is_served_what_capture_on_emits[agent-experimental-span-only-schema-v2] - AssertionError: assert not [DivergenceId(owner='log', owner_name='gen_ai.client.inference.operation.details', path=('attributes', 'gen_ai.operati...vergenceId(owner='log', owner_name='gen_ai.client.inference.operation.details', path=('attributes', 'server.address'))]
Unit Tests (Python 3.11)
FAILED tests/unittests/telemetry/test_web_ui_functional.py::test_web_ui_is_served_what_capture_on_emits[agent-experimental-span-only-schema-v1] - AssertionError: assert not [DivergenceId(owner='log', owner_name='gen_ai.client.inference.operation.details', path=('attributes', 'gen_ai.operati...vergenceId(owner='log', owner_name='gen_ai.client.inference.operation.details', path=('attributes', 'server.address'))]
Unit Tests (Python 3.11)
FAILED tests/unittests/telemetry/test_web_ui_functional.py::test_web_ui_is_served_what_capture_on_emits[agent-experimental-no-content-schema-v2] - AssertionError: assert not [DivergenceId(owner='log', owner_name='gen_ai.client.inference.operation.details', path=('attributes', 'gen_ai.operati...vergenceId(owner='log', owner_name='gen_ai.client.inference.operation.details', path=('attributes', 'server.address'))]
Unit Tests (Python 3.11)
FAILED tests/unittests/telemetry/test_web_ui_functional.py::test_web_ui_is_served_what_capture_on_emits[agent-experimental-no-content-schema-v1] - AssertionError: assert not [DivergenceId(owner='log', owner_name='gen_ai.client.inference.operation.details', path=('attributes', 'gen_ai.operati...vergenceId(owner='log', owner_name='gen_ai.client.inference.operation.details', path=('attributes', 'server.address'))]
Unit Tests (Python 3.11)
FAILED tests/unittests/telemetry/test_web_ui_functional.py::test_web_ui_is_served_what_capture_on_emits[agent-stable-capture-schema-v1] - AssertionError: assert not [DivergenceId(owner='log', owner_name='gen_ai.client.inference.operation.details', path=('attributes', 'gen_ai.operati...vergenceId(owner='log', owner_name='gen_ai.client.inference.operation.details', path=('attributes', 'server.address'))]
Unit Tests (Python 3.11)
FAILED tests/unittests/telemetry/test_web_ui_functional.py::test_web_ui_is_served_what_capture_on_emits[agent-stable-no-capture-schema-v1] - AssertionError: assert not [DivergenceId(owner='log', owner_name='gen_ai.client.inference.operation.details', path=('attributes', 'gen_ai.operati...vergenceId(owner='log', owner_name='gen_ai.client.inference.operation.details', path=('attributes', 'server.address'))]
Unit Tests (Python 3.11)
Process completed with exit code 1.
Unit Tests (Python 3.13)
FAILED tests/unittests/telemetry/test_web_ui_functional.py::test_web_ui_is_served_what_capture_on_emits[agent-experimental-span-and-event-schema-v2] - AssertionError: assert not [DivergenceId(owner='log', owner_name='gen_ai.client.inference.operation.details', path=('attributes', 'gen_ai.operati...vergenceId(owner='log', owner_name='gen_ai.client.inference.operation.details', path=('attributes', 'server.address'))]
Unit Tests (Python 3.13)
FAILED tests/unittests/telemetry/test_web_ui_functional.py::test_web_ui_is_served_what_capture_on_emits[agent-experimental-span-and-event-schema-v1] - AssertionError: assert not [DivergenceId(owner='log', owner_name='gen_ai.client.inference.operation.details', path=('attributes', 'gen_ai.operati...vergenceId(owner='log', owner_name='gen_ai.client.inference.operation.details', path=('attributes', 'server.address'))]
Unit Tests (Python 3.13)
FAILED tests/unittests/telemetry/test_web_ui_functional.py::test_web_ui_is_served_what_capture_on_emits[agent-experimental-event-only-schema-v2] - AssertionError: assert not [DivergenceId(owner='log', owner_name='gen_ai.client.inference.operation.details', path=('attributes', 'gen_ai.operati...vergenceId(owner='log', owner_name='gen_ai.client.inference.operation.details', path=('attributes', 'server.address'))]
Unit Tests (Python 3.13)
FAILED tests/unittests/telemetry/test_web_ui_functional.py::test_web_ui_is_served_what_capture_on_emits[agent-experimental-event-only-schema-v1] - AssertionError: assert not [DivergenceId(owner='log', owner_name='gen_ai.client.inference.operation.details', path=('attributes', 'gen_ai.operati...vergenceId(owner='log', owner_name='gen_ai.client.inference.operation.details', path=('attributes', 'server.address'))]
Unit Tests (Python 3.13)
FAILED tests/unittests/telemetry/test_web_ui_functional.py::test_web_ui_is_served_what_capture_on_emits[agent-experimental-span-only-schema-v2] - AssertionError: assert not [DivergenceId(owner='log', owner_name='gen_ai.client.inference.operation.details', path=('attributes', 'gen_ai.operati...vergenceId(owner='log', owner_name='gen_ai.client.inference.operation.details', path=('attributes', 'server.address'))]
Unit Tests (Python 3.13)
FAILED tests/unittests/telemetry/test_web_ui_functional.py::test_web_ui_is_served_what_capture_on_emits[agent-experimental-span-only-schema-v1] - AssertionError: assert not [DivergenceId(owner='log', owner_name='gen_ai.client.inference.operation.details', path=('attributes', 'gen_ai.operati...vergenceId(owner='log', owner_name='gen_ai.client.inference.operation.details', path=('attributes', 'server.address'))]
Unit Tests (Python 3.13)
FAILED tests/unittests/telemetry/test_web_ui_functional.py::test_web_ui_is_served_what_capture_on_emits[agent-experimental-no-content-schema-v2] - AssertionError: assert not [DivergenceId(owner='log', owner_name='gen_ai.client.inference.operation.details', path=('attributes', 'gen_ai.operati...vergenceId(owner='log', owner_name='gen_ai.client.inference.operation.details', path=('attributes', 'server.address'))]
Unit Tests (Python 3.13)
FAILED tests/unittests/telemetry/test_web_ui_functional.py::test_web_ui_is_served_what_capture_on_emits[agent-experimental-no-content-schema-v1] - AssertionError: assert not [DivergenceId(owner='log', owner_name='gen_ai.client.inference.operation.details', path=('attributes', 'gen_ai.operati...vergenceId(owner='log', owner_name='gen_ai.client.inference.operation.details', path=('attributes', 'server.address'))]
Unit Tests (Python 3.13)
FAILED tests/unittests/telemetry/test_web_ui_functional.py::test_web_ui_is_served_what_capture_on_emits[agent-stable-capture-schema-v1] - AssertionError: assert not [DivergenceId(owner='log', owner_name='gen_ai.client.inference.operation.details', path=('attributes', 'gen_ai.operati...vergenceId(owner='log', owner_name='gen_ai.client.inference.operation.details', path=('attributes', 'server.address'))]
Unit Tests (Python 3.13)
FAILED tests/unittests/telemetry/test_web_ui_functional.py::test_web_ui_is_served_what_capture_on_emits[agent-stable-no-capture-schema-v1] - AssertionError: assert not [DivergenceId(owner='log', owner_name='gen_ai.client.inference.operation.details', path=('attributes', 'gen_ai.operati...vergenceId(owner='log', owner_name='gen_ai.client.inference.operation.details', path=('attributes', 'server.address'))]
Unit Tests (Python 3.13)
Process completed with exit code 1.
Unit Tests (Python 3.12)
FAILED tests/unittests/telemetry/test_web_ui_functional.py::test_web_ui_is_served_what_capture_on_emits[agent-experimental-span-and-event-schema-v2] - AssertionError: assert not [DivergenceId(owner='log', owner_name='gen_ai.client.inference.operation.details', path=('attributes', 'gen_ai.operati...vergenceId(owner='log', owner_name='gen_ai.client.inference.operation.details', path=('attributes', 'server.address'))]
Unit Tests (Python 3.12)
FAILED tests/unittests/telemetry/test_web_ui_functional.py::test_web_ui_is_served_what_capture_on_emits[agent-experimental-span-and-event-schema-v1] - AssertionError: assert not [DivergenceId(owner='log', owner_name='gen_ai.client.inference.operation.details', path=('attributes', 'gen_ai.operati...vergenceId(owner='log', owner_name='gen_ai.client.inference.operation.details', path=('attributes', 'server.address'))]
Unit Tests (Python 3.12)
FAILED tests/unittests/telemetry/test_web_ui_functional.py::test_web_ui_is_served_what_capture_on_emits[agent-experimental-event-only-schema-v2] - AssertionError: assert not [DivergenceId(owner='log', owner_name='gen_ai.client.inference.operation.details', path=('attributes', 'gen_ai.operati...vergenceId(owner='log', owner_name='gen_ai.client.inference.operation.details', path=('attributes', 'server.address'))]
Unit Tests (Python 3.12)
FAILED tests/unittests/telemetry/test_web_ui_functional.py::test_web_ui_is_served_what_capture_on_emits[agent-experimental-event-only-schema-v1] - AssertionError: assert not [DivergenceId(owner='log', owner_name='gen_ai.client.inference.operation.details', path=('attributes', 'gen_ai.operati...vergenceId(owner='log', owner_name='gen_ai.client.inference.operation.details', path=('attributes', 'server.address'))]
Unit Tests (Python 3.12)
FAILED tests/unittests/telemetry/test_web_ui_functional.py::test_web_ui_is_served_what_capture_on_emits[agent-experimental-span-only-schema-v2] - AssertionError: assert not [DivergenceId(owner='log', owner_name='gen_ai.client.inference.operation.details', path=('attributes', 'gen_ai.operati...vergenceId(owner='log', owner_name='gen_ai.client.inference.operation.details', path=('attributes', 'server.address'))]
Unit Tests (Python 3.12)
FAILED tests/unittests/telemetry/test_web_ui_functional.py::test_web_ui_is_served_what_capture_on_emits[agent-experimental-span-only-schema-v1] - AssertionError: assert not [DivergenceId(owner='log', owner_name='gen_ai.client.inference.operation.details', path=('attributes', 'gen_ai.operati...vergenceId(owner='log', owner_name='gen_ai.client.inference.operation.details', path=('attributes', 'server.address'))]
Unit Tests (Python 3.12)
FAILED tests/unittests/telemetry/test_web_ui_functional.py::test_web_ui_is_served_what_capture_on_emits[agent-experimental-no-content-schema-v2] - AssertionError: assert not [DivergenceId(owner='log', owner_name='gen_ai.client.inference.operation.details', path=('attributes', 'gen_ai.operati...vergenceId(owner='log', owner_name='gen_ai.client.inference.operation.details', path=('attributes', 'server.address'))]
Unit Tests (Python 3.12)
FAILED tests/unittests/telemetry/test_web_ui_functional.py::test_web_ui_is_served_what_capture_on_emits[agent-experimental-no-content-schema-v1] - AssertionError: assert not [DivergenceId(owner='log', owner_name='gen_ai.client.inference.operation.details', path=('attributes', 'gen_ai.operati...vergenceId(owner='log', owner_name='gen_ai.client.inference.operation.details', path=('attributes', 'server.address'))]
Unit Tests (Python 3.12)
FAILED tests/unittests/telemetry/test_web_ui_functional.py::test_web_ui_is_served_what_capture_on_emits[agent-stable-capture-schema-v1] - AssertionError: assert not [DivergenceId(owner='log', owner_name='gen_ai.client.inference.operation.details', path=('attributes', 'gen_ai.operati...vergenceId(owner='log', owner_name='gen_ai.client.inference.operation.details', path=('attributes', 'server.address'))]
Unit Tests (Python 3.12)
FAILED tests/unittests/telemetry/test_web_ui_functional.py::test_web_ui_is_served_what_capture_on_emits[agent-stable-no-capture-schema-v1] - AssertionError: assert not [DivergenceId(owner='log', owner_name='gen_ai.client.inference.operation.details', path=('attributes', 'gen_ai.operati...vergenceId(owner='log', owner_name='gen_ai.client.inference.operation.details', path=('attributes', 'server.address'))]
Unit Tests (Python 3.12)
Process completed with exit code 1.
Unit Tests (Python 3.14)
FAILED tests/unittests/telemetry/test_web_ui_functional.py::test_web_ui_is_served_what_capture_on_emits[agent-experimental-span-and-event-schema-v1] - AssertionError: assert not [DivergenceId(owner='log', owner_name='gen_ai.client.inference.operation.details', path=('attributes', 'gen_ai.operati...vergenceId(owner='log', owner_name='gen_ai.client.inference.operation.details', path=('attributes', 'server.address'))]
Unit Tests (Python 3.14)
FAILED tests/unittests/telemetry/test_web_ui_functional.py::test_web_ui_is_served_what_capture_on_emits[agent-experimental-event-only-schema-v2] - AssertionError: assert not [DivergenceId(owner='log', owner_name='gen_ai.client.inference.operation.details', path=('attributes', 'gen_ai.operati...vergenceId(owner='log', owner_name='gen_ai.client.inference.operation.details', path=('attributes', 'server.address'))]
Unit Tests (Python 3.14)
FAILED tests/unittests/telemetry/test_web_ui_functional.py::test_web_ui_is_served_what_capture_on_emits[agent-experimental-event-only-schema-v1] - AssertionError: assert not [DivergenceId(owner='log', owner_name='gen_ai.client.inference.operation.details', path=('attributes', 'gen_ai.operati...vergenceId(owner='log', owner_name='gen_ai.client.inference.operation.details', path=('attributes', 'server.address'))]
Unit Tests (Python 3.14)
FAILED tests/unittests/telemetry/test_web_ui_functional.py::test_web_ui_is_served_what_capture_on_emits[agent-experimental-span-only-schema-v2] - AssertionError: assert not [DivergenceId(owner='log', owner_name='gen_ai.client.inference.operation.details', path=('attributes', 'gen_ai.operati...vergenceId(owner='log', owner_name='gen_ai.client.inference.operation.details', path=('attributes', 'server.address'))]
Unit Tests (Python 3.14)
FAILED tests/unittests/telemetry/test_web_ui_functional.py::test_web_ui_is_served_what_capture_on_emits[agent-experimental-span-only-schema-v1] - AssertionError: assert not [DivergenceId(owner='log', owner_name='gen_ai.client.inference.operation.details', path=('attributes', 'gen_ai.operati...vergenceId(owner='log', owner_name='gen_ai.client.inference.operation.details', path=('attributes', 'server.address'))]
Unit Tests (Python 3.14)
FAILED tests/unittests/telemetry/test_web_ui_functional.py::test_web_ui_is_served_what_capture_on_emits[agent-experimental-no-content-schema-v2] - AssertionError: assert not [DivergenceId(owner='log', owner_name='gen_ai.client.inference.operation.details', path=('attributes', 'gen_ai.operati...vergenceId(owner='log', owner_name='gen_ai.client.inference.operation.details', path=('attributes', 'server.address'))]
Unit Tests (Python 3.14)
FAILED tests/unittests/telemetry/test_web_ui_functional.py::test_web_ui_is_served_what_capture_on_emits[agent-experimental-no-content-schema-v1] - AssertionError: assert not [DivergenceId(owner='log', owner_name='gen_ai.client.inference.operation.details', path=('attributes', 'gen_ai.operati...vergenceId(owner='log', owner_name='gen_ai.client.inference.operation.details', path=('attributes', 'server.address'))]
Unit Tests (Python 3.14)
FAILED tests/unittests/telemetry/test_web_ui_functional.py::test_web_ui_is_served_what_capture_on_emits[agent-stable-capture-schema-v1] - AssertionError: assert not [DivergenceId(owner='log', owner_name='gen_ai.client.inference.operation.details', path=('attributes', 'gen_ai.operati...vergenceId(owner='log', owner_name='gen_ai.client.inference.operation.details', path=('attributes', 'server.address'))]
Unit Tests (Python 3.14)
FAILED tests/unittests/telemetry/test_web_ui_functional.py::test_web_ui_is_served_what_capture_on_emits[agent-stable-no-capture-schema-v1] - AssertionError: assert not [DivergenceId(owner='log', owner_name='gen_ai.client.inference.operation.details', path=('attributes', 'gen_ai.operati...vergenceId(owner='log', owner_name='gen_ai.client.inference.operation.details', path=('attributes', 'server.address'))]
Unit Tests (Python 3.14)
FAILED tests/unittests/test_samples.py::test_sample[samples/core/hello_world/roll_and_check.json] - AssertionError: assert [{'content': ...ld_agent@1'}}] == [{'actions': ...ld_agent@1'}}]
Unit Tests (Python 3.14)
Process completed with exit code 1.
Pre-commit Linter
Node.js 20 is deprecated. The following actions target Node.js 20 but are being forced to run on Node.js 24: actions/cache@v4. For more information see: https://github.blog/changelog/2025-09-19-deprecation-of-node-20-on-github-actions-runners/
A2A v0.3 Tests (Python 3.13)
"The ubuntu-latest label will migrate to Ubuntu 26 beginning October 19, 2026. For more information, see https://github.com/actions/runner-images/issues/14748"
A2A v0.3 Tests (Python 3.11)
"The ubuntu-latest label will migrate to Ubuntu 26 beginning October 19, 2026. For more information, see https://github.com/actions/runner-images/issues/14748"
MCP v2 Tests (Python 3.14)
"The ubuntu-latest label will migrate to Ubuntu 26 beginning October 19, 2026. For more information, see https://github.com/actions/runner-images/issues/14748"
MCP v2 Tests (Python 3.11)
"The ubuntu-latest label will migrate to Ubuntu 26 beginning October 19, 2026. For more information, see https://github.com/actions/runner-images/issues/14748"
MCP v2 Tests (Python 3.13)
"The ubuntu-latest label will migrate to Ubuntu 26 beginning October 19, 2026. For more information, see https://github.com/actions/runner-images/issues/14748"
A2A v0.3 Tests (Python 3.12)
"The ubuntu-latest label will migrate to Ubuntu 26 beginning October 19, 2026. For more information, see https://github.com/actions/runner-images/issues/14748"
MCP v2 Tests (Python 3.12)
"The ubuntu-latest label will migrate to Ubuntu 26 beginning October 19, 2026. For more information, see https://github.com/actions/runner-images/issues/14748"
A2A v0.3 Tests (Python 3.14)
"The ubuntu-latest label will migrate to Ubuntu 26 beginning October 19, 2026. For more information, see https://github.com/actions/runner-images/issues/14748"
Pre-commit Linter
"The ubuntu-latest label will migrate to Ubuntu 26 beginning October 19, 2026. For more information, see https://github.com/actions/runner-images/issues/14748"
Mypy Check (Python 3.11)
"The ubuntu-latest label will migrate to Ubuntu 26 beginning October 19, 2026. For more information, see https://github.com/actions/runner-images/issues/14748"
Mypy Check (Python 3.12)
"The ubuntu-latest label will migrate to Ubuntu 26 beginning October 19, 2026. For more information, see https://github.com/actions/runner-images/issues/14748"
Mypy Check (Python 3.13)
"The ubuntu-latest label will migrate to Ubuntu 26 beginning October 19, 2026. For more information, see https://github.com/actions/runner-images/issues/14748"
Unit Tests (Python 3.11)
"The ubuntu-latest label will migrate to Ubuntu 26 beginning October 19, 2026. For more information, see https://github.com/actions/runner-images/issues/14748"
Unit Tests (Python 3.13)
"The ubuntu-latest label will migrate to Ubuntu 26 beginning October 19, 2026. For more information, see https://github.com/actions/runner-images/issues/14748"
Unit Tests (Python 3.12)
"The ubuntu-latest label will migrate to Ubuntu 26 beginning October 19, 2026. For more information, see https://github.com/actions/runner-images/issues/14748"
Unit Tests (Python 3.14)
"The ubuntu-latest label will migrate to Ubuntu 26 beginning October 19, 2026. For more information, see https://github.com/actions/runner-images/issues/14748"